Target
D(4) dopamine receptor
Ligand
BDBM50071215
Substrate
Meas. Tech.
ChEMBL_63086 (CHEMBL676182)
IC50
2.00±n/a nM
Citation
 Arlt, MBöttcher, HRiethmüller, ASchneider, GBartoszyk, GDGreiner, HSeyfried, CA SAR of novel biarylmethylamine dopamine D4 receptor ligands. Bioorg Med Chem Lett 8:2033-8 (1999)  
Target
Name:
D(4) dopamine receptor
Synonyms:
D(2C) dopamine receptor DOPAMINE D4.2 DRD4 Dopamine D4 receptor
Type:
Enzyme
Mol. Mass.:
48373.19
Organism:
Homo sapiens (Human)
Description:
P21917
Residue:
419
  
Inhibitor
Name:
BDBM50071215
Synonyms:
2-[4-(4'-Fluoro-biphenyl-3-ylmethyl)-piperazin-1-yl]-pyrimidine | CHEMBL59942
Type:
Small organic molecule
Emp. Form.:
C21H21FN4
Mol. Mass.:
348.4166
SMILES:
Fc1ccc(cc1)-c1cccc(CN2CCN(CC2)c2ncccn2)c1
: