Target
D(3) dopamine receptor
Ligand
BDBM50071218
Substrate
Meas. Tech.
ChEBML_61971
IC50
200±n/a nM
Citation
 Arlt, MBöttcher, HRiethmüller, ASchneider, GBartoszyk, GDGreiner, HSeyfried, CA SAR of novel biarylmethylamine dopamine D4 receptor ligands. Bioorg Med Chem Lett 8:2033-8 (1999)  
Target
Name:
D(3) dopamine receptor
Synonyms:
DOPAMINE D3 DRD3_HUMAN Dopamine D3 receptor (D3) Dopamine receptor Dopamine receptor D3
Type:
Mol. Mass.:
44243.43
Organism:
Homo sapiens (Human)
Description:
Residue:
400
  
Inhibitor
Name:
BDBM50071218
Synonyms:
1-(4-Fluoro-phenyl)-4-[5-(4-fluoro-phenyl)-pyridin-3-ylmethyl]-piperazine | CHEMBL291824
Type:
Small organic molecule
Emp. Form.:
C22H21F2N3
Mol. Mass.:
365.419
SMILES:
Fc1ccc(cc1)N1CCN(Cc2cncc(c2)-c2ccc(F)cc2)CC1
: