Target
D(4) dopamine receptor
Ligand
BDBM50071214
Substrate
Meas. Tech.
ChEBML_63086
IC50
6±n/a nM
Citation
 Arlt, MBöttcher, HRiethmüller, ASchneider, GBartoszyk, GDGreiner, HSeyfried, CA SAR of novel biarylmethylamine dopamine D4 receptor ligands. Bioorg Med Chem Lett 8:2033-8 (1999)  
Target
Name:
D(4) dopamine receptor
Synonyms:
D(2C) dopamine receptor DOPAMINE D4.2 DRD4 Dopamine D4 receptor
Type:
Enzyme
Mol. Mass.:
48373.19
Organism:
Homo sapiens (Human)
Description:
P21917
Residue:
419
  
Inhibitor
Name:
BDBM50071214
Synonyms:
1-[5-(4-Fluoro-phenyl)-pyridin-3-ylmethyl]-4-phenyl-piperazine | CHEMBL302904
Type:
Small organic molecule
Emp. Form.:
C22H22FN3
Mol. Mass.:
347.4286
SMILES:
Fc1ccc(cc1)-c1cncc(CN2CCN(CC2)c2ccccc2)c1
: