Target
Neuromedin-B receptor
Ligand
BDBM50071735
Substrate
Meas. Tech.
ChEBML_39622
Ki
0.150000±n/a nM
Citation
 Ashwood, VBrownhill, VHigginbottom, MHorwell, DCHughes, JLewthwaite, RAMcKnight, ATPinnock, RDPritchard, MCSuman-Chauhan, NWebb, CWilliams, SC PD 176252--the first high affinity non-peptide gastrin-releasing peptide (BB2) receptor antagonist. Bioorg Med Chem Lett 8:2589-94 (1999)  
Target
Name:
Neuromedin-B receptor
Synonyms:
Bombesin 1 NMBR Neuromedin B Neuromedin-B receptor | Neuromedin-B-preferring bombesin receptor
Type:
Enzyme Catalytic Domain
Mol. Mass.:
43447.11
Organism:
Homo sapiens (Human)
Description:
Bombesin 1 NMBR 0::P28336
Residue:
390
  
Inhibitor
Name:
BDBM50071735
Synonyms:
(S)-3-(1H-Indol-3-yl)-2-methyl-2-[3-(4-nitro-phenyl)-ureido]-N-(1-pyridin-2-yl-cyclohexylmethyl)-propionamide | CHEMBL329650
Type:
Small organic molecule
Emp. Form.:
C31H34N6O4
Mol. Mass.:
554.6395
SMILES:
C[C@@](Cc1c[nH]c2ccccc12)(NC(=O)Nc1ccc(cc1)[N+]([O-])=O)C(=O)NCC1(CCCCC1)c1ccccn1
: