Target
Sodium-dependent dopamine transporter
Ligand
BDBM50028094
Substrate
Meas. Tech.
ChEBML_184248
Ki
260±n/a nM
Citation
 Carlier, PRLo, MMLo, PCRichelson, ETatsumi, MReynolds, IJSharma, TA Synthesis of a potent wide-spectrum serotonin-, norepinephrine-, dopamine-reuptake inhibitor (SNDRI) and a species-selective dopamine-reuptake inhibitor based on the gamma-amino alcohol functional group. Bioorg Med Chem Lett 8:487-92 (1999)  
Target
Name:
Sodium-dependent dopamine transporter
Synonyms:
DA transporter SC6A3_RAT Sodium-dependent dopamine transporter | Sodium-dependent dopamine transporter (DAT)
Type:
Multi-pass membrane protein
Mol. Mass.:
68749.45
Organism:
Rattus norvegicus (rat)
Description:
P23977
Residue:
619
  
Inhibitor
Name:
BDBM50028094
Synonyms:
(1S,4S)-4-(3,4-dichlorophenyl)-N-methyl-1,2,3,4-tetrahydronaphthalen-1-amine CHEMBL809 | SERTRALINE
Type:
Small organic molecule
Emp. Form.:
C17H17Cl2N
Mol. Mass.:
306.23
SMILES:
CN[C@H]1CC[C@@H](c2ccc(Cl)c(Cl)c2)c2ccccc12
: