Target
Adenosine receptor A1
Ligand
BDBM50069320
Substrate
Meas. Tech.
ChEMBL_27425 (CHEMBL646669)
EC50
869±n/a nM
Citation
 Camp, DGreen, JMKaiser, SMMoni, RWTownsend-Nicholson, ASchofield, PRQuinn, RJ Diimidazo[1,2-c:4',5'-e]pyrimidines: adenosine agonist activity demonstrated by microphysiometry. Bioorg Med Chem Lett 8:691-4 (1999)  
Target
Name:
Adenosine receptor A1
Synonyms:
A1 adenosine receptor (hA1) AA1R_HUMAN ADORA1 Adenosine A1-receptor Adenosine receptor A1 (hA1) | Adenosine transporter (AdT)
Type:
G Protein-Coupled Receptor (GPCR)
Mol. Mass.:
36520.92
Organism:
Homo sapiens (Human)
Description:
P30542
Residue:
326
  
Inhibitor
Name:
BDBM50069320
Synonyms:
(2S,3S,4S,5S)-2-(6-Amino-purin-9-yl)-5-(1-methyl-1-phenyl-ethoxymethyl)-tetrahydro-furan-3,4-diol | CHEMBL162752
Type:
Small organic molecule
Emp. Form.:
C19H23N5O4
Mol. Mass.:
385.417
SMILES:
CC(C)(OC[C@@H]1O[C@@H]([C@@H](O)[C@@H]1O)n1cnc2c(N)ncnc12)c1ccccc1
: