Target
Macrophage metalloelastase
Ligand
BDBM8465
Substrate
Meas. Tech.
ChEBML_103854
IC50
7.7±n/a nM
Citation
 Jeng, AYChou, MParker, DT Sulfonamide-based hydroxamic acids as potent inhibitors of mouse macrophage metalloelastase. Bioorg Med Chem Lett 8:897-902 (1999)  
Target
Name:
Macrophage metalloelastase
Synonyms:
MMP12_MOUSE Mme Mmp12
Type:
PROTEIN
Mol. Mass.:
54988.61
Organism:
Mus musculus
Description:
ChEMBL_796155
Residue:
473
  
Inhibitor
Name:
BDBM8465
Synonyms:
(2R)-N-hydroxy-2-[(4-methoxybenzene)(pyridin-3-ylmethyl)sulfonamido]-3-methylbutanamide CGS 27023 CHEMBL514138 | hydroxamate analogue 1
Type:
Small organic molecule
Emp. Form.:
C18H23N3O5S
Mol. Mass.:
393.457
SMILES:
COc1ccc(cc1)S(=O)(=O)N(Cc1cccnc1)[C@H](C(C)C)C(=O)NO
: