Target
Metabotropic glutamate receptor 2
Ligand
BDBM50052398
Substrate
Meas. Tech.
ChEBML_218871
EC50
200±n/a nM
Citation
 Kozikowski, APAraldi, GLTückmantel, WPshenichkin, SSurina, EWroblewski, JT 1-amino-APDC, a partial agonist of group II metabotropic glutamate receptors with neuroprotective properties. Bioorg Med Chem Lett 9:1721-6 (1999)  
Target
Name:
Metabotropic glutamate receptor 2
Synonyms:
GRM2_RAT Grm2 | Mglur2
Type:
PROTEIN
Mol. Mass.:
95786.41
Organism:
Rattus norvegicus
Description:
ChEMBL_105034
Residue:
872
  
Inhibitor
Name:
BDBM50052398
Synonyms:
(2R,4R)-4-aminopyrrolidine-2,4-dicarboxylic acid 2R, 4R-APDC | CHEMBL40086
Type:
Small organic molecule
Emp. Form.:
C6H10N2O4
Mol. Mass.:
174.1546
SMILES:
N[C@]1(CN[C@H](C1)C(O)=O)C(O)=O
: