Target
Metabotropic glutamate receptor 2
Ligand
BDBM50078596
Substrate
Meas. Tech.
ChEBML_218871
EC50
4800±n/a nM
Citation
 Kozikowski, APAraldi, GLTückmantel, WPshenichkin, SSurina, EWroblewski, JT 1-amino-APDC, a partial agonist of group II metabotropic glutamate receptors with neuroprotective properties. Bioorg Med Chem Lett 9:1721-6 (1999)  
Target
Name:
Metabotropic glutamate receptor 2
Synonyms:
GRM2_RAT Grm2 | Mglur2
Type:
PROTEIN
Mol. Mass.:
95786.41
Organism:
Rattus norvegicus
Description:
ChEMBL_105034
Residue:
872
  
Inhibitor
Name:
BDBM50078596
Synonyms:
(2R,4R)-1,4-Diamino-pyrrolidine-2,4-dicarboxylic acid CHEMBL297150
Type:
Small organic molecule
Emp. Form.:
C6H11N3O4
Mol. Mass.:
189.1692
SMILES:
NN1C[C@](N)(C[C@@H]1C(O)=O)C(O)=O
: