Target
Metabotropic glutamate receptor 2
Ligand
BDBM66976
Substrate
Meas. Tech.
ChEBML_218871
EC50
2100±n/a nM
Citation
 Kozikowski, APAraldi, GLTückmantel, WPshenichkin, SSurina, EWroblewski, JT 1-amino-APDC, a partial agonist of group II metabotropic glutamate receptors with neuroprotective properties. Bioorg Med Chem Lett 9:1721-6 (1999)  
Target
Name:
Metabotropic glutamate receptor 2
Synonyms:
GRM2_RAT Grm2 | Mglur2
Type:
PROTEIN
Mol. Mass.:
95786.41
Organism:
Rattus norvegicus
Description:
ChEMBL_105034
Residue:
872
  
Inhibitor
Name:
BDBM66976
Synonyms:
(1S,3R)-1-aminocyclopentane-1,3-dicarboxylic acid;hydrate CHEMBL34453 SMR001230688 trans-( )-ACPD monohydrate
Type:
Small organic molecule
Emp. Form.:
C7H11NO4
Mol. Mass.:
173.1665
SMILES:
N[C@]1(CC[C@H](C1)C(O)=O)C(O)=O
: