Target
Metabotropic glutamate receptor 3
Ligand
BDBM17657
Substrate
Meas. Tech.
ChEBML_219009
EC50
2500±n/a nM
Citation
 Kozikowski, APAraldi, GLTückmantel, WPshenichkin, SSurina, EWroblewski, JT 1-amino-APDC, a partial agonist of group II metabotropic glutamate receptors with neuroprotective properties. Bioorg Med Chem Lett 9:1721-6 (1999)  
Target
Name:
Metabotropic glutamate receptor 3
Synonyms:
GPRC1C GRM3_HUMAN metabotropic glutamate 3 metabotropic glutamate 3/1c
Type:
Enzyme Catalytic Domain
Mol. Mass.:
98889.09
Organism:
Homo sapiens (Human)
Description:
metabotropic glutamate 1c 0 HUMAN::Q14832
Residue:
879
  
Inhibitor
Name:
BDBM17657
Synonyms:
(2S)-2-aminopentanedioic acid D-Glutamate L-Glu L-Glutamic acid L-gluatmate
Type:
Amino Acid
Emp. Form.:
C5H9NO4
Mol. Mass.:
147.1293
SMILES:
N[C@@H](CCC(O)=O)C(O)=O
: