Target
Metabotropic glutamate receptor 3
Ligand
BDBM50078596
Substrate
Meas. Tech.
ChEBML_219009
EC50
52000±n/a nM
Citation
 Kozikowski, APAraldi, GLTückmantel, WPshenichkin, SSurina, EWroblewski, JT 1-amino-APDC, a partial agonist of group II metabotropic glutamate receptors with neuroprotective properties. Bioorg Med Chem Lett 9:1721-6 (1999)  
Target
Name:
Metabotropic glutamate receptor 3
Synonyms:
GPRC1C GRM3_HUMAN metabotropic glutamate 3 metabotropic glutamate 3/1c
Type:
Enzyme Catalytic Domain
Mol. Mass.:
98889.09
Organism:
Homo sapiens (Human)
Description:
metabotropic glutamate 1c 0 HUMAN::Q14832
Residue:
879
  
Inhibitor
Name:
BDBM50078596
Synonyms:
(2R,4R)-1,4-Diamino-pyrrolidine-2,4-dicarboxylic acid CHEMBL297150
Type:
Small organic molecule
Emp. Form.:
C6H11N3O4
Mol. Mass.:
189.1692
SMILES:
NN1C[C@](N)(C[C@@H]1C(O)=O)C(O)=O
: