Target
Metabotropic glutamate receptor 3
Ligand
BDBM66976
Substrate
Meas. Tech.
ChEBML_219009
EC50
30000±n/a nM
Citation
 Kozikowski, APAraldi, GLTückmantel, WPshenichkin, SSurina, EWroblewski, JT 1-amino-APDC, a partial agonist of group II metabotropic glutamate receptors with neuroprotective properties. Bioorg Med Chem Lett 9:1721-6 (1999)  
Target
Name:
Metabotropic glutamate receptor 3
Synonyms:
GPRC1C GRM3_HUMAN metabotropic glutamate 3 metabotropic glutamate 3/1c
Type:
Enzyme Catalytic Domain
Mol. Mass.:
98889.09
Organism:
Homo sapiens (Human)
Description:
metabotropic glutamate 1c 0 HUMAN::Q14832
Residue:
879
  
Inhibitor
Name:
BDBM66976
Synonyms:
(1S,3R)-1-aminocyclopentane-1,3-dicarboxylic acid;hydrate CHEMBL34453 SMR001230688 trans-( )-ACPD monohydrate
Type:
Small organic molecule
Emp. Form.:
C7H11NO4
Mol. Mass.:
173.1665
SMILES:
N[C@]1(CC[C@H](C1)C(O)=O)C(O)=O
: