Target
Lysosomal acid glucosylceramidase
Ligand
BDBM50350757
Substrate
Meas. Tech.
ChEBML_37574
Ki
110±n/a nM
Citation
 Schuster, M Homoisofagomines: chemical-enzymatic synthesis and evaluation as alpha- and beta-glucosidase inhibitors. Bioorg Med Chem Lett 9:615-8 (1999)  
Target
Name:
Lysosomal acid glucosylceramidase
Synonyms:
Acid beta-glucosidase Beta-glucocerebrosidase D-glucosyl-N-acylsphingosine glucohydrolase GBA1 GC GLUC Glucosylceramidase (GBA) Glucosylceramidase precursor (Beta-glucocerebrosidase) (Acid beta-glucosidase) (D-glucosyl-N-acylsphingosine glucohydrolase) (Alglucerase) (Imiglucerase) beta-glucocerebrosidase (GCase)
Type:
Enzyme
Mol. Mass.:
59724.64
Organism:
Homo sapiens (Human)
Description:
The beta-Glu activity was measured with commercially available beta-glucocerebrosidase (Ceredase) as the enzyme source.
Residue:
536
  
Inhibitor
Name:
BDBM50350757
Synonyms:
CHEMBL1818432
Type:
Small organic molecule
Emp. Form.:
C6H13NO3
Mol. Mass.:
147.1723
SMILES:
OC[C@@H]1CNC[C@@H](O)[C@@H]1O
: