Target
Carbonic anhydrase 4
Ligand
BDBM50088766
Substrate
Meas. Tech.
ChEBML_45432
Ki
140±n/a nM
Citation
 Scozzafava, ASupuran, CT Carbonic anhydrase inhibitors: synthesis of N-morpholylthiocarbonylsulfenylamino aromatic/heterocyclic sulfonamides and their interaction with isozymes I, II and IV. Bioorg Med Chem Lett 10:1117-20 (2000)  
Target
Name:
Carbonic anhydrase 4
Synonyms:
CA-IV CAH4_BOVIN Carbonic Anhydrase IV Carbonic anhydrase 4
Type:
Enzyme
Mol. Mass.:
35152.74
Organism:
Bos taurus (bovine)
Description:
Bovine isozyme, isolated from lung microsomes
Residue:
312
  
Inhibitor
Name:
BDBM50088766
Synonyms:
CHEMBL13851 | N,N-dialkylthio-carbonylsulfenylamino derivative
Type:
Small organic molecule
Emp. Form.:
C10H15N3O2S3
Mol. Mass.:
305.44
SMILES:
CCN(C)C(=S)SNc1ccc(cc1)S(N)(=O)=O
: