Target
Carbonic anhydrase 4
Ligand
BDBM50088765
Substrate
Meas. Tech.
ChEBML_45432
Ki
290±n/a nM
Citation
 Scozzafava, ASupuran, CT Carbonic anhydrase inhibitors: synthesis of N-morpholylthiocarbonylsulfenylamino aromatic/heterocyclic sulfonamides and their interaction with isozymes I, II and IV. Bioorg Med Chem Lett 10:1117-20 (2000)  
Target
Name:
Carbonic anhydrase 4
Synonyms:
CA-IV CAH4_BOVIN Carbonic Anhydrase IV Carbonic anhydrase 4
Type:
Enzyme
Mol. Mass.:
35152.74
Organism:
Bos taurus (bovine)
Description:
Bovine isozyme, isolated from lung microsomes
Residue:
312
  
Inhibitor
Name:
BDBM50088765
Synonyms:
CHEMBL14039 | N,N-dialkylthio-carbonylsulfenylamino derivative
Type:
Small organic molecule
Emp. Form.:
C11H15N3O3S3
Mol. Mass.:
333.45
SMILES:
NS(=O)(=O)c1cccc(NSC(=S)N2CCOCC2)c1
: