Target
Glutamate receptor ionotropic, kainate 1
Ligand
BDBM50091488
Substrate
Meas. Tech.
ChEBML_71990
Ki
152±n/a nM
Citation
 Baker, SRBleakman, DEzquerra, JBallyk, BADeverill, MHo, KKamboj, RKCollado, IDomínguez, CEscribano, AMateo, AIPedregal, CRubio, A 4-Alkylidenyl glutamic acids, potent and selective GluR5 agonists. Bioorg Med Chem Lett 10:1807-10 (2000)  
Target
Name:
Glutamate receptor ionotropic, kainate 1
Synonyms:
GLUR5 GRIK1_HUMAN Glutamate kainate Glutamate receptor ionotropic kainate 1 Glutamate-Kainate Grik1 protein | hmglur5 flipr
Type:
Enzyme Catalytic Domain
Mol. Mass.:
103984.96
Organism:
Homo sapiens (Human)
Description:
P39086
Residue:
918
  
Inhibitor
Name:
BDBM50091488
Synonyms:
(S)-2-Amino-4-[1-cyclopentyl-meth-(E)-ylidene]-pentanedioic acid | CHEMBL299291
Type:
Small organic molecule
Emp. Form.:
C11H17NO4
Mol. Mass.:
227.257
SMILES:
N[C@@H](C\C(=C/C1CCCC1)C(O)=O)C(O)=O
: