Target
Glutamate receptor ionotropic, kainate 1
Ligand
BDBM50091475
Substrate
Meas. Tech.
ChEBML_71990
Ki
94±n/a nM
Citation
 Baker, SRBleakman, DEzquerra, JBallyk, BADeverill, MHo, KKamboj, RKCollado, IDomínguez, CEscribano, AMateo, AIPedregal, CRubio, A 4-Alkylidenyl glutamic acids, potent and selective GluR5 agonists. Bioorg Med Chem Lett 10:1807-10 (2000)  
Target
Name:
Glutamate receptor ionotropic, kainate 1
Synonyms:
GLUR5 GRIK1_HUMAN Glutamate kainate Glutamate receptor ionotropic kainate 1 Glutamate-Kainate Grik1 protein | hmglur5 flipr
Type:
Enzyme Catalytic Domain
Mol. Mass.:
103984.96
Organism:
Homo sapiens (Human)
Description:
P39086
Residue:
918
  
Inhibitor
Name:
BDBM50091475
Synonyms:
(2S,4Z)-2-amino-4-(2-methylpropylidene)pentanedioic acid LY-339675
Type:
Small organic molecule
Emp. Form.:
C9H15NO4
Mol. Mass.:
201.2197
SMILES:
CC(C)\C=C(\C[C@H](N)C(O)=O)C(O)=O
: