Target
Alpha-1B adrenergic receptor
Ligand
BDBM50091719
Substrate
Meas. Tech.
ChEBML_34345
Ki
15±n/a nM
Citation
 Barrow, JCGlass, KLSelnick, HGFreidinger, RMChang, RSO'Malley, SSWoyden, C Preparation and evaluation of 1,3-diaminocyclopentane-linked dihydropyrimidinone derivatives as selective alpha1a-receptor antagonists. Bioorg Med Chem Lett 10:1917-20 (2001)  
Target
Name:
Alpha-1B adrenergic receptor
Synonyms:
ADA1B_HUMAN Adrenergic alpha1B Adrenergic receptor alpha Alpha 1B-adrenoreceptor | Alpha-1B adrenergic receptor
Type:
Enzyme
Mol. Mass.:
56862.13
Organism:
Homo sapiens (Human)
Description:
P35368
Residue:
520
  
Inhibitor
Name:
BDBM50091719
Synonyms:
(S)-3-{(1S,3S)-3-[4-(2-Cyano-phenyl)-piperazin-1-yl]-cyclopentylcarbamoyl}-4-(3,4-difluoro-phenyl)-6-methoxymethyl-2-oxo-1,2,3,4-tetrahydro-pyrimidine-5-carboxylic acid methyl ester | CHEMBL278716
Type:
Small organic molecule
Emp. Form.:
C31H34F2N6O5
Mol. Mass.:
608.6357
SMILES:
COCC1=C([C@@H](N(C(=O)N[C@H]2CC[C@@H](C2)N2CCN(CC2)c2ccccc2C#N)C(=O)N1)c1ccc(F)c(F)c1)C(=O)OC
: