Target
Protein kinase C eta type
Ligand
BDBM50092015
Substrate
Meas. Tech.
ChEMBL_161137 (CHEMBL767405)
Ki
2160±n/a nM
Citation
 Nakagawa, YIrie, KOhigashi, HHayashi, HWender, PA Synthesis and PKC isozyme surrogate binding of indothiolactam-V, a new thioamide analogue of tumor promoting indolactam-V. Bioorg Med Chem Lett 10:2087-90 (2000)  
Target
Name:
Protein kinase C eta type
Synonyms:
KPCL_HUMAN PKCL PRKCL Protein kinase C, PKC; classical/novel | nPKC-eta
Type:
Enzyme
Mol. Mass.:
77844.26
Organism:
Homo sapiens (Human)
Description:
The recombinant human PKC enzymes were produced using a baculovirus expression system in SF9 cells
Residue:
683
  
Inhibitor
Name:
BDBM50092015
Synonyms:
(10S,13S)-13-Hydroxymethyl-10-isopropyl-9-methyl-3,9,12-triaza-tricyclo[6.6.1.0*4,15*]pentadeca-1,4,6,8(15)-tetraene-11-thione | CHEMBL63262
Type:
Small organic molecule
Emp. Form.:
C17H23N3OS
Mol. Mass.:
317.449
SMILES:
CC(C)[C@@H]1N(C)c2cccc3[nH]cc(C[C@@H](CO)NC1=S)c23
: