Target
Estrogen receptor
Ligand
BDBM50041611
Substrate
Meas. Tech.
ChEMBL_67491 (CHEMBL679882)
IC50
654±n/a nM
Citation
 Miller, CPJirkovsky, ITran, BDHarris, HAMoran, RAKomm, BS Synthesis and estrogenic activities of novel 7-thiosubstituted estratriene derivatives. Bioorg Med Chem Lett 10:147-51 (2000)  
Target
Name:
Estrogen receptor
Synonyms:
ER ESR ESR1_HUMAN Estrogen receptor Estrogen receptor (ER-alpha) Estrogen receptor alpha (ER) Nuclear receptor subfamily 3 group A member 1
Type:
Protein
Mol. Mass.:
66230.44
Organism:
Homo sapiens (Human)
Description:
P03372
Residue:
595
  
Inhibitor
Name:
BDBM50041611
Synonyms:
(2E)-3-{4-[(1E)-1,2-DIPHENYLBUT-1-ENYL]PHENYL}ACRYLIC ACID CHEMBL33899
Type:
Small organic molecule
Emp. Form.:
C25H22O2
Mol. Mass.:
354.441
SMILES:
CC\C(=C(/c1ccccc1)c1ccc(\C=C\C(O)=O)cc1)c1ccccc1
: