Target
Excitatory amino acid transporter 2
Ligand
BDBM50093754
Substrate
Meas. Tech.
ChEMBL_68327 (CHEMBL680698)
IC50
1300±n/a nM
Citation
 Shimamoto, KShigeri, YYasuda-Kamatani, YLebrun, BYumoto, NNakajima, T Syntheses of optically pure beta-hydroxyaspartate derivatives as glutamate transporter blockers. Bioorg Med Chem Lett 10:2407-10 (2001)  
Target
Name:
Excitatory amino acid transporter 2
Synonyms:
EAA2_HUMAN GLT1 SLC1A2 Solute carrier family 1 member 2
Type:
Enzyme Catalytic Domain
Mol. Mass.:
62103.57
Organism:
Homo sapiens (Human)
Description:
Excitatory Amino Acid EAAT2 0 0::P43004
Residue:
574
  
Inhibitor
Name:
BDBM50093754
Synonyms:
(2S, 3S)-3-Amino-2-(naphthalen-1-ylmethoxy)-pentanedioic acid | CHEMBL80642
Type:
Small organic molecule
Emp. Form.:
C15H15NO5
Mol. Mass.:
289.2833
SMILES:
N[C@@H]([C@H](OCc1cccc2ccccc12)C(O)=O)C(O)=O
: