Target
Sodium-dependent dopamine transporter
Ligand
BDBM50093781
Substrate
Meas. Tech.
ChEMBL_62004 (CHEMBL670187)
IC50
34±n/a nM
Citation
 Blough, BEHolmquist, CRAbraham, PKuhar, MJCarroll, FI 3alpha-(4-Substituted phenyl)nortropane-2beta-carboxylic acid methyl esters show selective binding at the norepinephrine transporter. Bioorg Med Chem Lett 10:2445-7 (2001)  
Target
Name:
Sodium-dependent dopamine transporter
Synonyms:
DA transporter SC6A3_RAT Sodium-dependent dopamine transporter | Sodium-dependent dopamine transporter (DAT)
Type:
Multi-pass membrane protein
Mol. Mass.:
68749.45
Organism:
Rattus norvegicus (rat)
Description:
P23977
Residue:
619
  
Inhibitor
Name:
BDBM50093781
Synonyms:
3-p-Tolyl-8-aza-bicyclo[3.2.1]octane CHEMBL80262
Type:
Small organic molecule
Emp. Form.:
C16H21NO2
Mol. Mass.:
259.3434
SMILES:
COC(=O)C1C2CCC(CC1c1ccc(C)cc1)N2
: