Target
Squalene monooxygenase
Ligand
BDBM50093887
Substrate
Meas. Tech.
ChEBML_201944
IC50
61±n/a nM
Citation
 Abe, IKashiwagi, YNoguchi, H Inhibition of vertebrate squalene epoxidase by isoprenyl gallates and phenylalkyl gallates. Bioorg Med Chem Lett 10:2525-8 (2001)  
Target
Name:
Squalene monooxygenase
Synonyms:
ERG1_RAT SE | Sqle
Type:
PROTEIN
Mol. Mass.:
64038.00
Organism:
Rattus norvegicus
Description:
ChEMBL_505339
Residue:
573
  
Inhibitor
Name:
BDBM50093887
Synonyms:
3,4,5-Trihydroxy-benzoic acid dodecyl ester Dodecyl 3,4,5-trihydroxybenzoate n-dodecylgallate
Type:
Small organic molecule
Emp. Form.:
C19H30O5
Mol. Mass.:
338.4385
SMILES:
CCCCCCCCCCCCOC(=O)c1cc(O)c(O)c(O)c1
: