Target
Nitric oxide synthase, inducible
Ligand
BDBM50095181
Substrate
Meas. Tech.
ChEBML_89175
Ki
160±n/a nM
Citation
 Lee, YMartásek, PRoman, LJSilverman, RB 1H-pyrazole-1-carboxamidines: new inhibitors of nitric oxide synthase. Bioorg Med Chem Lett 10:2771-4 (2000)  
Target
Name:
Nitric oxide synthase, inducible
Synonyms:
Inducible NO synthase Inducible nitric oxide synthase (iNOS) MAC-NOS NOS type II Nitric Oxide Synthase, inducible Nos2
Type:
Enzyme
Mol. Mass.:
130595.79
Organism:
Mus musculus (mouse)
Description:
Recombinant enzyme overexpressed in E. coli.
Residue:
1144
  
Inhibitor
Name:
BDBM50095181
Synonyms:
CHEMBL96680 | N-(3-Aminomethyl-phenyl)-furan-2-carboxamidine
Type:
Small organic molecule
Emp. Form.:
C12H13N3O
Mol. Mass.:
215.2511
SMILES:
NCc1cccc(NC(=N)c2ccco2)c1
: