Target
RAF proto-oncogene serine/threonine-protein kinase
Ligand
BDBM50085411
Substrate
Meas. Tech.
ChEMBL_217655 (CHEMBL820190)
IC50
40±n/a nM
Citation
 Lackey, KCory, MDavis, RFrye, SVHarris, PAHunter, RNJung, DKMcDonald, OBMcNutt, RWPeel, MRRutkowske, RDVeal, JMWood, ER The discovery of potent cRaf1 kinase inhibitors. Bioorg Med Chem Lett 10:223-6 (2000)  
Target
Name:
RAF proto-oncogene serine/threonine-protein kinase
Synonyms:
C-Raf Protein Kinase RAF RAF1 Raf-1 Serine/threonine-protein kinase C-Raf | cRaf
Type:
Serine/threonine-protein kinase
Mol. Mass.:
73082.52
Organism:
Homo sapiens (Human)
Description:
P04049
Residue:
648
  
Inhibitor
Name:
BDBM50085411
Synonyms:
3-[1-(3,5-Dichloro-4-hydroxy-phenyl)-meth-(Z)-ylidene]-5-(furan-2-carbonyl)-1,3-dihydro-indol-2-one GSK screening, 31
Type:
Small organic molecule
Emp. Form.:
C20H11Cl2NO4
Mol. Mass.:
400.212
SMILES:
Oc1c(Cl)cc(\C=C2/C(=O)Nc3ccc(cc23)C(=O)c2ccco2)cc1Cl
: