Target
RAF proto-oncogene serine/threonine-protein kinase
Ligand
BDBM50085408
Substrate
Meas. Tech.
ChEBML_217655
IC50
16±n/a nM
Citation
 Lackey, KCory, MDavis, RFrye, SVHarris, PAHunter, RNJung, DKMcDonald, OBMcNutt, RWPeel, MRRutkowske, RDVeal, JMWood, ER The discovery of potent cRaf1 kinase inhibitors. Bioorg Med Chem Lett 10:223-6 (2000)  
Target
Name:
RAF proto-oncogene serine/threonine-protein kinase
Synonyms:
C-Raf Protein Kinase RAF RAF1 Raf-1 Serine/threonine-protein kinase C-Raf | cRaf
Type:
Serine/threonine-protein kinase
Mol. Mass.:
73082.52
Organism:
Homo sapiens (Human)
Description:
P04049
Residue:
648
  
Inhibitor
Name:
BDBM50085408
Synonyms:
2-Amino-8-[1-(3,5-dibromo-4-hydroxy-phenyl)-meth-(Z)-ylidene]-6,8-dihydro-thiazolo[4,5-e]indol-7-one | CHEMBL418892
Type:
Small organic molecule
Emp. Form.:
C16H9Br2N3O2S
Mol. Mass.:
467.135
SMILES:
Nc1nc2c3\C(=C\c4cc(Br)c(O)c(Br)c4)C(=O)Nc3ccc2s1
: