Target
RAF proto-oncogene serine/threonine-protein kinase
Ligand
BDBM50366677
Substrate
Meas. Tech.
ChEBML_217655
IC50
11±n/a nM
Citation
 Lackey, KCory, MDavis, RFrye, SVHarris, PAHunter, RNJung, DKMcDonald, OBMcNutt, RWPeel, MRRutkowske, RDVeal, JMWood, ER The discovery of potent cRaf1 kinase inhibitors. Bioorg Med Chem Lett 10:223-6 (2000)  
Target
Name:
RAF proto-oncogene serine/threonine-protein kinase
Synonyms:
C-Raf Protein Kinase RAF RAF1 Raf-1 Serine/threonine-protein kinase C-Raf | cRaf
Type:
Serine/threonine-protein kinase
Mol. Mass.:
73082.52
Organism:
Homo sapiens (Human)
Description:
P04049
Residue:
648
  
Inhibitor
Name:
BDBM50366677
Synonyms:
CHEMBL1794050
Type:
Small organic molecule
Emp. Form.:
C20H12Br2N2O2
Mol. Mass.:
472.129
SMILES:
Oc1c(Br)cc(C=C2C(=O)Nc3ccc(cc23)-c2cccnc2)cc1Br
: