Target
RAF proto-oncogene serine/threonine-protein kinase
Ligand
BDBM50085412
Substrate
Meas. Tech.
ChEBML_217655
IC50
18±n/a nM
Citation
 Lackey, KCory, MDavis, RFrye, SVHarris, PAHunter, RNJung, DKMcDonald, OBMcNutt, RWPeel, MRRutkowske, RDVeal, JMWood, ER The discovery of potent cRaf1 kinase inhibitors. Bioorg Med Chem Lett 10:223-6 (2000)  
Target
Name:
RAF proto-oncogene serine/threonine-protein kinase
Synonyms:
C-Raf Protein Kinase RAF RAF1 Raf-1 Serine/threonine-protein kinase C-Raf | cRaf
Type:
Serine/threonine-protein kinase
Mol. Mass.:
73082.52
Organism:
Homo sapiens (Human)
Description:
P04049
Residue:
648
  
Inhibitor
Name:
BDBM50085412
Synonyms:
5-Benzoyl-3-[1-(3,5-dibromo-4-hydroxy-phenyl)-meth-(Z)-ylidene]-1,3-dihydro-indol-2-one | CHEMBL73554
Type:
Small organic molecule
Emp. Form.:
C22H13Br2NO3
Mol. Mass.:
499.152
SMILES:
Oc1c(Br)cc(\C=C2/C(=O)Nc3ccc(cc23)C(=O)c2ccccc2)cc1Br
: