Target
RAF proto-oncogene serine/threonine-protein kinase
Ligand
BDBM50085413
Substrate
Meas. Tech.
ChEBML_217655
IC50
32±n/a nM
Citation
 Lackey, KCory, MDavis, RFrye, SVHarris, PAHunter, RNJung, DKMcDonald, OBMcNutt, RWPeel, MRRutkowske, RDVeal, JMWood, ER The discovery of potent cRaf1 kinase inhibitors. Bioorg Med Chem Lett 10:223-6 (2000)  
Target
Name:
RAF proto-oncogene serine/threonine-protein kinase
Synonyms:
C-Raf Protein Kinase RAF RAF1 Raf-1 Serine/threonine-protein kinase C-Raf | cRaf
Type:
Serine/threonine-protein kinase
Mol. Mass.:
73082.52
Organism:
Homo sapiens (Human)
Description:
P04049
Residue:
648
  
Inhibitor
Name:
BDBM50085413
Synonyms:
3-(3,5-dichloro-4-hydroxybenzylidene)-5-phenylindolin-2-one CHEMBL73470
Type:
Small organic molecule
Emp. Form.:
C21H13Cl2NO2
Mol. Mass.:
382.239
SMILES:
Oc1c(Cl)cc(\C=C2/C(=O)Nc3ccc(cc23)-c2ccccc2)cc1Cl
: