Target
RAF proto-oncogene serine/threonine-protein kinase
Ligand
BDBM50358043
Substrate
Meas. Tech.
ChEBML_217655
IC50
9±n/a nM
Citation
 Lackey, KCory, MDavis, RFrye, SVHarris, PAHunter, RNJung, DKMcDonald, OBMcNutt, RWPeel, MRRutkowske, RDVeal, JMWood, ER The discovery of potent cRaf1 kinase inhibitors. Bioorg Med Chem Lett 10:223-6 (2000)  
Target
Name:
RAF proto-oncogene serine/threonine-protein kinase
Synonyms:
C-Raf Protein Kinase RAF RAF1 Raf-1 Serine/threonine-protein kinase C-Raf | cRaf
Type:
Serine/threonine-protein kinase
Mol. Mass.:
73082.52
Organism:
Homo sapiens (Human)
Description:
P04049
Residue:
648
  
Inhibitor
Name:
BDBM50358043
Synonyms:
CHEMBL1794051 | GW-5074
Type:
Small organic molecule
Emp. Form.:
C15H10Br2INO2
Mol. Mass.:
522.958
SMILES:
OC1Nc2ccc(I)cc2C1=Cc1cc(Br)c(O)c(Br)c1
: