Target
RAF proto-oncogene serine/threonine-protein kinase
Ligand
BDBM50085417
Substrate
Meas. Tech.
ChEBML_217655
IC50
29±n/a nM
Citation
 Lackey, KCory, MDavis, RFrye, SVHarris, PAHunter, RNJung, DKMcDonald, OBMcNutt, RWPeel, MRRutkowske, RDVeal, JMWood, ER The discovery of potent cRaf1 kinase inhibitors. Bioorg Med Chem Lett 10:223-6 (2000)  
Target
Name:
RAF proto-oncogene serine/threonine-protein kinase
Synonyms:
C-Raf Protein Kinase RAF RAF1 Raf-1 Serine/threonine-protein kinase C-Raf | cRaf
Type:
Serine/threonine-protein kinase
Mol. Mass.:
73082.52
Organism:
Homo sapiens (Human)
Description:
P04049
Residue:
648
  
Inhibitor
Name:
BDBM50085417
Synonyms:
3-[1-(3,5-Dibromo-4-hydroxy-phenyl)-meth-(Z)-ylidene]-2-oxo-2,3-dihydro-1H-indole-5-sulfonic acid bis-(2-hydroxy-ethyl)-amide | CHEMBL311402
Type:
Small organic molecule
Emp. Form.:
C19H18Br2N2O6S
Mol. Mass.:
562.229
SMILES:
OCCN(CCO)S(=O)(=O)c1ccc2NC(=O)\C(=C/c3cc(Br)c(O)c(Br)c3)c2c1
: