Target
Nitric oxide synthase, endothelial
Ligand
BDBM50086464
Substrate
Meas. Tech.
ChEBML_64983
IC50
>1000000±n/a nM
Citation
 Young, RJBeams, RMCarter, KClark, HACoe, DMChambers, CLDavies, PIDawson, JDrysdale, MJFranzman, KWFrench, CHodgson, STHodson, HFKleanthous, SRider, PSanders, DSawyer, DAScott, KJShearer, BGStocker, RSmith, STackley, MCKnowles, RG Inhibition of inducible nitric oxide synthase by acetamidine derivatives of hetero-substituted lysine and homolysine. Bioorg Med Chem Lett 10:597-600 (2000)  
Target
Name:
Nitric oxide synthase, endothelial
Synonyms:
Constitutive NOS Endothelial NOS NOS type III NOS3_HUMAN Nitric oxide synthase (inducible and endothelial) Nitric-oxide synthase (endothelial and brain) eNOS
Type:
Enzyme Catalytic Domain
Mol. Mass.:
133297.84
Organism:
Homo sapiens (Human)
Description:
P29474
Residue:
1203
  
Inhibitor
Name:
BDBM50086464
Synonyms:
(S)-3-(2-Acetimidoylamino-ethanesulfonyl)-2-amino-propionic acid | CHEMBL154895
Type:
Small organic molecule
Emp. Form.:
C7H15N3O4S
Mol. Mass.:
237.277
SMILES:
CC(=N)NCCS(=O)(=O)C[C@@H](N)C(O)=O
: