Target
Carbonic anhydrase 4
Ligand
BDBM50087265
Substrate
Meas. Tech.
ChEBML_45274
Ki
4±n/a nM
Citation
 Renzi, GScozzafava, ASupuran, CT Carbonic anhydrase inhibitors: topical sulfonamide antiglaucoma agents incorporating secondary amine moieties. Bioorg Med Chem Lett 10:673-6 (2000)  
Target
Name:
Carbonic anhydrase 4
Synonyms:
CA-IV CAH4_BOVIN Carbonic Anhydrase IV Carbonic anhydrase 4
Type:
Enzyme
Mol. Mass.:
35152.74
Organism:
Bos taurus (bovine)
Description:
Bovine isozyme, isolated from lung microsomes
Residue:
312
  
Inhibitor
Name:
BDBM50087265
Synonyms:
5-{4-[(7-Chloro-2-oxo-2H-chromen-4-ylmethyl)-amino]-benzenesulfonylamino}-[1,3,4]thiadiazole-2-sulfonic acid amide | CHEMBL161438
Type:
Small organic molecule
Emp. Form.:
C18H14ClN5O6S3
Mol. Mass.:
527.982
SMILES:
NS(=O)(=O)c1nnc(NS(=O)(=O)c2ccc(NCc3cc(=O)oc4cc(Cl)ccc34)cc2)s1
: