Target
Mu-type opioid receptor
Ligand
BDBM50087684
Substrate
Meas. Tech.
ChEBML_149009
Ki
13±n/a nM
Citation
 Röver, SWichmann, JJenck, FAdam, GCesura, AM ORL1 receptor ligands: structure-activity relationships of 8-cycloalkyl-1-phenyl-1,3,8-triaza-spiro[4.5]decan-4-ones. Bioorg Med Chem Lett 10:831-4 (2000)  
Target
Name:
Mu-type opioid receptor
Synonyms:
MOR-1 Mu-type opioid receptor (MOR) OPRM_RAT Opioid receptor B Ror-b
Type:
G Protein-Coupled Receptor (GPCR)
Mol. Mass.:
44503.11
Organism:
Rattus norvegicus (rat)
Description:
Competition binding assays were carried out using membrane preparations from transfected HN9.10 cells that constitutively expressed the mu opioid receptor.
Residue:
398
  
Inhibitor
Name:
BDBM50087684
Synonyms:
8-Cyclooctyl-1-phenyl-1,3,8-triaza-spiro[4.5]decan-4-one | CHEMBL353990
Type:
Small organic molecule
Emp. Form.:
C21H31N3O
Mol. Mass.:
341.4903
SMILES:
O=C1NCN(c2ccccc2)C11CCN(CC1)C1CCCCCCC1
: