Target
Delta-type opioid receptor
Ligand
BDBM50087684
Substrate
Meas. Tech.
ChEBML_147055
Ki
>200±n/a nM
Citation
 Röver, SWichmann, JJenck, FAdam, GCesura, AM ORL1 receptor ligands: structure-activity relationships of 8-cycloalkyl-1-phenyl-1,3,8-triaza-spiro[4.5]decan-4-ones. Bioorg Med Chem Lett 10:831-4 (2000)  
Target
Name:
Delta-type opioid receptor
Synonyms:
Cytochrome P450 3A4 Delta opioid receptor Delta-type opioid receptor (DOR) OPRD_RAT Opioid receptor Opioid receptors; mu & delta Ror-a | Voltage-gated potassium channel
Type:
G Protein-Coupled Receptor (GPCR)
Mol. Mass.:
40465.04
Organism:
Rattus norvegicus (rat)
Description:
Competition binding assays were using CHO-K1 cell membranes expressing the opioid receptor.
Residue:
372
  
Inhibitor
Name:
BDBM50087684
Synonyms:
8-Cyclooctyl-1-phenyl-1,3,8-triaza-spiro[4.5]decan-4-one | CHEMBL353990
Type:
Small organic molecule
Emp. Form.:
C21H31N3O
Mol. Mass.:
341.4903
SMILES:
O=C1NCN(c2ccccc2)C11CCN(CC1)C1CCCCCCC1
: