Target
Thymidine kinase
Ligand
BDBM50366680
Substrate
Meas. Tech.
ChEBML_208206
IC50
3300±n/a nM
Citation
 Manfredini, SBaraldi, PGDurini, EPorcu, LAngusti, AVertuani, SSolaroli, NDe Clercq, EKarlsson, ABalzarini, J Design, synthesis and enzymatic activity of highly selective human mitochondrial thymidine kinase inhibitors. Bioorg Med Chem Lett 11:1329-32 (2001)  
Target
Name:
Thymidine kinase
Synonyms:
KITH_VZVD | TK
Type:
PROTEIN
Mol. Mass.:
37819.99
Organism:
Varicella-zoster virus (strain Dumas) (HHV-3) (Human herpesvirus 3)
Description:
ChEMBL_444706
Residue:
341
  
Inhibitor
Name:
BDBM50366680
Synonyms:
CHEMBL605255
Type:
Small organic molecule
Emp. Form.:
C11H13BrN2O6
Mol. Mass.:
349.135
SMILES:
OC[C@H]1OC([C@@H](O)[C@@H]1O)n1cc(C=CBr)c(=O)[nH]c1=O
: