Target
Deoxynucleoside kinase
Ligand
BDBM50087289
Substrate
Meas. Tech.
ChEBML_53736
IC50
5319000±n/a nM
Citation
 Manfredini, SBaraldi, PGDurini, EPorcu, LAngusti, AVertuani, SSolaroli, NDe Clercq, EKarlsson, ABalzarini, J Design, synthesis and enzymatic activity of highly selective human mitochondrial thymidine kinase inhibitors. Bioorg Med Chem Lett 11:1329-32 (2001)  
Target
Name:
Deoxynucleoside kinase
Synonyms:
DNK_DROME Dm-dNK dnk
Type:
PROTEIN
Mol. Mass.:
29092.93
Organism:
Drosophila melanogaster
Description:
ChEMBL_627484
Residue:
250
  
Inhibitor
Name:
BDBM50087289
Synonyms:
1-beta-D-Arabinofuranosylcytosine 4-amino-1-beta-D-arabinofuranosylpyrimidin-2(1H)-one CYTARABINE
Type:
Small organic molecule
Emp. Form.:
C9H13N3O5
Mol. Mass.:
243.2166
SMILES:
Nc1ccn([C@@H]2O[C@H](CO)[C@@H](O)[C@@H]2O)c(=O)n1
: