Target
Thymidine kinase
Ligand
BDBM50100414
Substrate
Meas. Tech.
ChEBML_208206
IC50
>1000000±n/a nM
Citation
 Manfredini, SBaraldi, PGDurini, EPorcu, LAngusti, AVertuani, SSolaroli, NDe Clercq, EKarlsson, ABalzarini, J Design, synthesis and enzymatic activity of highly selective human mitochondrial thymidine kinase inhibitors. Bioorg Med Chem Lett 11:1329-32 (2001)  
Target
Name:
Thymidine kinase
Synonyms:
KITH_VZVD | TK
Type:
PROTEIN
Mol. Mass.:
37819.99
Organism:
Varicella-zoster virus (strain Dumas) (HHV-3) (Human herpesvirus 3)
Description:
ChEMBL_444706
Residue:
341
  
Inhibitor
Name:
BDBM50100414
Synonyms:
1-(4-Hydroxy-5-hydroxymethyl-3-octyloxy-tetrahydro-furan-2-yl)-5-methyl-1H-pyrimidine-2,4-dione CHEMBL400411
Type:
Small organic molecule
Emp. Form.:
C18H30N2O6
Mol. Mass.:
370.4406
SMILES:
CCCCCCCCO[C@H]1[C@H](O)[C@@H](CO)O[C@H]1n1cc(C)c(=O)[nH]c1=O
: