Target
Thymidine kinase
Ligand
BDBM50087289
Substrate
Meas. Tech.
ChEBML_208206
IC50
>1000000±n/a nM
Citation
 Manfredini, SBaraldi, PGDurini, EPorcu, LAngusti, AVertuani, SSolaroli, NDe Clercq, EKarlsson, ABalzarini, J Design, synthesis and enzymatic activity of highly selective human mitochondrial thymidine kinase inhibitors. Bioorg Med Chem Lett 11:1329-32 (2001)  
Target
Name:
Thymidine kinase
Synonyms:
KITH_VZVD | TK
Type:
PROTEIN
Mol. Mass.:
37819.99
Organism:
Varicella-zoster virus (strain Dumas) (HHV-3) (Human herpesvirus 3)
Description:
ChEMBL_444706
Residue:
341
  
Inhibitor
Name:
BDBM50087289
Synonyms:
1-beta-D-Arabinofuranosylcytosine 4-amino-1-beta-D-arabinofuranosylpyrimidin-2(1H)-one CYTARABINE
Type:
Small organic molecule
Emp. Form.:
C9H13N3O5
Mol. Mass.:
243.2166
SMILES:
Nc1ccn([C@@H]2O[C@H](CO)[C@@H](O)[C@@H]2O)c(=O)n1
: