Target
Thymidine kinase
Ligand
BDBM50100406
Substrate
Meas. Tech.
ChEBML_208206
IC50
>1000000±n/a nM
Citation
 Manfredini, SBaraldi, PGDurini, EPorcu, LAngusti, AVertuani, SSolaroli, NDe Clercq, EKarlsson, ABalzarini, J Design, synthesis and enzymatic activity of highly selective human mitochondrial thymidine kinase inhibitors. Bioorg Med Chem Lett 11:1329-32 (2001)  
Target
Name:
Thymidine kinase
Synonyms:
KITH_VZVD | TK
Type:
PROTEIN
Mol. Mass.:
37819.99
Organism:
Varicella-zoster virus (strain Dumas) (HHV-3) (Human herpesvirus 3)
Description:
ChEMBL_444706
Residue:
341
  
Inhibitor
Name:
BDBM50100406
Synonyms:
1-(3-Benzyloxy-4-hydroxy-5-hydroxymethyl-tetrahydro-furan-2-yl)-5-methyl-1H-pyrimidine-2,4-dione | CHEMBL3143826
Type:
Small organic molecule
Emp. Form.:
C17H20N2O6
Mol. Mass.:
348.3505
SMILES:
Cc1cn([C@@H]2O[C@H](CO)[C@@H](O)[C@H]2OCc2ccccc2)c(=O)[nH]c1=O
: