Target
3-oxo-5-alpha-steroid 4-dehydrogenase 2
Ligand
BDBM50101150
Substrate
Meas. Tech.
ChEBML_749
IC50
>10000±n/a nM
Citation
 Lesuisse, DGourvest, JFAlbert, EDoucet, BHartmann, CLefrançois, JMTessier, STric, BTeutsch, G Biphenyls as surrogates of the steroidal backbone. Part 2: discovery of a novel family of non-steroidal 5-alpha-reductase inhibitors. Bioorg Med Chem Lett 11:1713-6 (2001)  
Target
Name:
3-oxo-5-alpha-steroid 4-dehydrogenase 2
Synonyms:
3-oxo-5-alpha-steroid 4-dehydrogenase 2 5α-Reductase 2 (5α-R2) SR type 2 Steroid 5-alpha-reductase Type II 5-alpha reductase
Type:
Enzyme
Mol. Mass.:
28406.59
Organism:
Homo sapiens (Human)
Description:
P31213
Residue:
254
  
Inhibitor
Name:
BDBM50101150
Synonyms:
2',6'-Dichloro-4'-[(diisopropylcarbamoyl)-methoxy]-biphenyl-4-carboxylic acid | CHEMBL295396
Type:
Small organic molecule
Emp. Form.:
C21H23Cl2NO4
Mol. Mass.:
424.318
SMILES:
CC(C)N(C(C)C)C(=O)COc1cc(Cl)c(c(Cl)c1)-c1ccc(cc1)C(O)=O
: