Target
Delta-type opioid receptor
Ligand
BDBM50101304
Substrate
Meas. Tech.
ChEBML_147175
Ki
1.2±n/a nM
Citation
 Nortey, SOBaxter, EWCodd, EEZhang, SPReitz, AB Piperazinyl benzamidines: synthesis and affinity for the delta opioid receptor. Bioorg Med Chem Lett 11:1741-3 (2001)  
Target
Name:
Delta-type opioid receptor
Synonyms:
Cytochrome P450 3A4 Delta opioid receptor Delta-type opioid receptor (DOR) OPRD_RAT Opioid receptor Opioid receptors; mu & delta Ror-a | Voltage-gated potassium channel
Type:
G Protein-Coupled Receptor (GPCR)
Mol. Mass.:
40465.04
Organism:
Rattus norvegicus (rat)
Description:
Competition binding assays were using CHO-K1 cell membranes expressing the opioid receptor.
Residue:
372
  
Inhibitor
Name:
BDBM50101304
Synonyms:
4-{(4-Benzyl-piperazin-1-yl)-[(Z)-2-trifluoromethyl-phenylimino]-methyl}-N,N-diethyl-benzamide | CHEMBL301516
Type:
Small organic molecule
Emp. Form.:
C30H33F3N4O
Mol. Mass.:
522.6044
SMILES:
CCN(CC)C(=O)c1ccc(cc1)C(=N\c1ccccc1C(F)(F)F)\N1CCN(Cc2ccccc2)CC1
: