Target
Prothrombin
Ligand
BDBM50102209
Substrate
Meas. Tech.
ChEBML_208175
Ki
530±n/a nM
Citation
 Kokko, KPArrigoni, CEDix, TA Selectivity enhancement induced by substitution of non-natural analogues of arginine and lysine in arginine-based thrombin inhibitors. Bioorg Med Chem Lett 11:1947-50 (2001)  
Target
Name:
Prothrombin
Synonyms:
Activation peptide fragment 1 Coagulation factor II Prothrombin precursor Thrombin heavy chain | Thrombin light chain
Type:
Protein
Mol. Mass.:
70029.57
Organism:
Homo sapiens (Human)
Description:
P00734
Residue:
622
  
Inhibitor
Name:
BDBM50102209
Synonyms:
5-Dimethylamino-naphthalene-1-sulfonic acid [4-(2-imino-imidazolidin-1-yl)-1-(piperidine-1-carbonyl)-butyl]-amide; hydrochloride | CHEMBL541285
Type:
Small organic molecule
Emp. Form.:
C25H36N6O3S
Mol. Mass.:
500.657
SMILES:
CN(C)c1cccc2c(cccc12)S(=O)(=O)NC(CCCN1CCN=C1N)C(=O)N1CCCCC1
: