Target
Prothrombin
Ligand
BDBM50102213
Substrate
Meas. Tech.
ChEBML_208175
Ki
>10000±n/a nM
Citation
 Kokko, KPArrigoni, CEDix, TA Selectivity enhancement induced by substitution of non-natural analogues of arginine and lysine in arginine-based thrombin inhibitors. Bioorg Med Chem Lett 11:1947-50 (2001)  
Target
Name:
Prothrombin
Synonyms:
Activation peptide fragment 1 Coagulation factor II Prothrombin precursor Thrombin heavy chain | Thrombin light chain
Type:
Protein
Mol. Mass.:
70029.57
Organism:
Homo sapiens (Human)
Description:
P00734
Residue:
622
  
Inhibitor
Name:
BDBM50102213
Synonyms:
5-Dimethylamino-naphthalene-1-sulfonic acid [6-methylamino-1-(piperidine-1-carbonyl)-heptyl]-amide; hydrochloride | CHEMBL543571
Type:
Small organic molecule
Emp. Form.:
C26H40N4O3S
Mol. Mass.:
488.686
SMILES:
CNC(C)CCCCC(NS(=O)(=O)c1cccc2c(cccc12)N(C)C)C(=O)N1CCCCC1
: