Target
Matrix metalloproteinase-9
Ligand
BDBM8465
Substrate
Meas. Tech.
ChEBML_105532
IC50
9±n/a nM
Citation
 Levin, JIChen, JDu, MHogan, MKincaid, SNelson, FCVenkatesan, AMWehr, TZask, ADiJoseph, JKillar, LMSkala, SSung, ASharr, MRoth, CJin, GCowling, RMohler, KMBlack, RAMarch, CJSkotnicki, JS The discovery of anthranilic acid-based MMP inhibitors. Part 2: SAR of the 5-position and P1(1) groups. Bioorg Med Chem Lett 11:2189-92 (2001)  
Target
Name:
Matrix metalloproteinase-9
Synonyms:
67 kDa matrix metalloproteinase-9 92 kDa gelatinase CLG4B Gelatinase B MMP9 Matrix metalloproteinase 9 (MMP-9) Matrix metalloproteinase-9 (MMP9)
Type:
Enzyme
Mol. Mass.:
78452.28
Organism:
Homo sapiens (Human)
Description:
P14780
Residue:
707
  
Inhibitor
Name:
BDBM8465
Synonyms:
(2R)-N-hydroxy-2-[(4-methoxybenzene)(pyridin-3-ylmethyl)sulfonamido]-3-methylbutanamide CGS 27023 CHEMBL514138 | hydroxamate analogue 1
Type:
Small organic molecule
Emp. Form.:
C18H23N3O5S
Mol. Mass.:
393.457
SMILES:
COc1ccc(cc1)S(=O)(=O)N(Cc1cccnc1)[C@H](C(C)C)C(=O)NO
: