Target
Acetylcholinesterase
Ligand
BDBM50104604
Substrate
Meas. Tech.
ChEMBL_27387 (CHEMBL644292)
IC50
>500000±n/a nM
Citation
 Högenauer, KBaumann, KEnz, AMulzer, J Synthesis and acetylcholinesterase inhibition of 5-desamino huperzine A derivatives. Bioorg Med Chem Lett 11:2627-30 (2001)  
Target
Name:
Acetylcholinesterase
Synonyms:
ACES_RAT Acetylcholinesterase and butyrylcholinesterase (AChE and BChE) Acetylcholinesterase, AChE | Ache
Type:
Enzyme
Mol. Mass.:
68193.62
Organism:
Rattus norvegicus (rat)
Description:
P37136
Residue:
614
  
Inhibitor
Name:
BDBM50104604
Synonyms:
11-Methyl-6-aza-tricyclo[7.3.1.0*2,7*]trideca-2(7),3,10-triene-5,13-dione | CHEMBL421550
Type:
Small organic molecule
Emp. Form.:
C13H13NO2
Mol. Mass.:
215.2478
SMILES:
CC1=CC2Cc3[nH]c(=O)ccc3C(C1)C2=O
: