Target
Histone deacetylase
Ligand
BDBM50366734
Substrate
Meas. Tech.
ChEBML_79057
IC50
23±n/a nM
Citation
 Colletti, SLMyers, RWDarkin-Rattray, SJGurnett, AMDulski, PMGaluska, SAllocco, JJAyer, MBLi, CLim, JCrumley, TMCannova, CSchmatz, DMWyvratt, MJFisher, MHMeinke, PT Broad spectrum antiprotozoal agents that inhibit histone deacetylase: structure-activity relationships of apicidin. Part 2. Bioorg Med Chem Lett 11:113-7 (2001)  
Target
Name:
Histone deacetylase
Synonyms:
Type:
PROTEIN
Mol. Mass.:
50433.01
Organism:
Cryptosporidium parvum
Description:
ChEMBL_79057
Residue:
444
  
Inhibitor
Name:
BDBM50366734
Synonyms:
CHEMBL1793967 | CHEMBL1793980
Type:
Small organic molecule
Emp. Form.:
C33H45N5O6
Mol. Mass.:
607.7403
SMILES:
CC[C@H](C)c1[nH]c(=O)c(nc(O)c(CCCCCC(=O)CC)[nH]c(O)c2CCCCn2c1O)C(O)c1c[nH]c2ccccc12
: