Target
Histone deacetylase
Ligand
BDBM50366735
Substrate
Meas. Tech.
ChEBML_79057
IC50
100±n/a nM
Citation
 Colletti, SLMyers, RWDarkin-Rattray, SJGurnett, AMDulski, PMGaluska, SAllocco, JJAyer, MBLi, CLim, JCrumley, TMCannova, CSchmatz, DMWyvratt, MJFisher, MHMeinke, PT Broad spectrum antiprotozoal agents that inhibit histone deacetylase: structure-activity relationships of apicidin. Part 2. Bioorg Med Chem Lett 11:113-7 (2001)  
Target
Name:
Histone deacetylase
Synonyms:
Type:
PROTEIN
Mol. Mass.:
50433.01
Organism:
Cryptosporidium parvum
Description:
ChEMBL_79057
Residue:
444
  
Inhibitor
Name:
BDBM50366735
Synonyms:
CHEMBL1793993
Type:
Small organic molecule
Emp. Form.:
C35H51N5O5
Mol. Mass.:
621.8099
SMILES:
CC[C@H](C)[C@@H]1NC(=O)[C@H](Cc2cn(CC)c3ccccc23)NC(=O)[C@H](CCCCCC(=O)CC)NC(=O)[C@H]2CCCCN2C1=O
: