Target
Histone deacetylase
Ligand
BDBM50366737
Substrate
Meas. Tech.
ChEBML_79059
Ki
10±n/a nM
Citation
 Colletti, SLMyers, RWDarkin-Rattray, SJGurnett, AMDulski, PMGaluska, SAllocco, JJAyer, MBLi, CLim, JCrumley, TMCannova, CSchmatz, DMWyvratt, MJFisher, MHMeinke, PT Broad spectrum antiprotozoal agents that inhibit histone deacetylase: structure-activity relationships of apicidin. Part 2. Bioorg Med Chem Lett 11:113-7 (2001)  
Target
Name:
Histone deacetylase
Synonyms:
Type:
PROTEIN
Mol. Mass.:
48692.87
Organism:
Cryptosporidium parvum
Description:
ChEMBL_87390
Residue:
432
  
Inhibitor
Name:
BDBM50366737
Synonyms:
CHEMBL1793971
Type:
Small organic molecule
Emp. Form.:
C33H45N5O6
Mol. Mass.:
607.7403
SMILES:
CC[C@H](C)[C@@H]1NC(=O)[C@@H](NC(=O)[C@H](CCCCCC(=O)CC)NC(=O)[C@H]2CCCCN2C1=O)c1cnc2ccccc2c1O
: